<?xml version="1.0" encoding="UTF-8"?>
<feed xmlns="http://www.w3.org/2005/Atom" xml:lang="en-gb">
	<link rel="self" type="application/atom+xml" href="https://pybullet.org/Bullet/phpBB3/app.php/feed/topic/6209" />

	<title>Real-Time Physics Simulation Forum</title>
	
	<link href="https://pybullet.org/Bullet/phpBB3/index.php" />
	<updated>2011-01-11T22:56:15+00:00</updated>

	<author><name><![CDATA[Real-Time Physics Simulation Forum]]></name></author>
	<id>https://pybullet.org/Bullet/phpBB3/app.php/feed/topic/6209</id>

		<entry>
		<author><name><![CDATA[ranxx]]></name></author>
		<updated>2011-01-11T22:56:15+00:00</updated>

		<published>2011-01-11T22:56:15+00:00</published>
		<id>https://pybullet.org/Bullet/phpBB3/viewtopic.php?p=21723#p21723</id>
		<link href="https://pybullet.org/Bullet/phpBB3/viewtopic.php?p=21723#p21723"/>
		<title type="html"><![CDATA[Re: compiling Dynamica for Maya 2010-x64 on Centos]]></title>

		
		<content type="html" xml:base="https://pybullet.org/Bullet/phpBB3/viewtopic.php?p=21723#p21723"><![CDATA[
ok,  -fPic added to compiler flags fixed it.<br><br> -ranxx<p>Statistics: Posted by <a href="https://pybullet.org/Bullet/phpBB3/memberlist.php?mode=viewprofile&amp;u=7633">ranxx</a> — Tue Jan 11, 2011 10:56 pm</p><hr />
]]></content>
	</entry>
		<entry>
		<author><name><![CDATA[ranxx]]></name></author>
		<updated>2011-01-10T22:33:38+00:00</updated>

		<published>2011-01-10T22:33:38+00:00</published>
		<id>https://pybullet.org/Bullet/phpBB3/viewtopic.php?p=21708#p21708</id>
		<link href="https://pybullet.org/Bullet/phpBB3/viewtopic.php?p=21708#p21708"/>
		<title type="html"><![CDATA[compiling Dynamica for Maya 2010-x64 on Centos]]></title>

		
		<content type="html" xml:base="https://pybullet.org/Bullet/phpBB3/viewtopic.php?p=21708#p21708"><![CDATA[
hey all,  I'm trying to compile Dynamica for Centos Maya 2010-x64.  I got the latest source using svn from the repository today, ran cmake with the following line: cmake -DBUILD_SHARED_LIBS=ON -DCMAKE_BUILD_TYPE=Release<br>then ran make, the make process goes on for a while and then I get the following errors:<br><br>[ 90%] Building CXX object src/BulletMultiThreaded/CMakeFiles/BulletMultiThreaded.dir/btParallelConstraintSolver.o<br>In file included from /home/gecker/dev/trunk/src/BulletMultiThreaded/btParallelConstraintSolver.cpp:18:<br>/home/gecker/dev/trunk/src/BulletMultiThreaded/btParallelConstraintSolver.h:283:43: warning: no newline at end of file<br>/home/gecker/dev/trunk/src/BulletMultiThreaded/btParallelConstraintSolver.cpp: In member function ‘virtual btScalar btParallelConstraintSolver::solveGroup(btCollisionObject**, int, btPersistentManifold**, int, btTypedConstraint**, int, const btContactSolverInfo&amp;, btIDebugDraw*, btStackAlloc*, btDispatcher*)’:<br>/home/gecker/dev/trunk/src/BulletMultiThreaded/btParallelConstraintSolver.cpp:1125: error: cast from ‘btPersistentManifold*’ to ‘uint32_t’ loses precision<br>/home/gecker/dev/trunk/src/BulletMultiThreaded/btParallelConstraintSolver.cpp:1285: error: cast from ‘btSolverConstraint*’ to ‘uint32_t’ loses precision<br>make[2]: *** [src/BulletMultiThreaded/CMakeFiles/BulletMultiThreaded.dir/btParallelConstraintSolver.o] Error 1<br>make[1]: *** [src/BulletMultiThreaded/CMakeFiles/BulletMultiThreaded.dir/all] Error 2<br>make: *** [all] Error 2<br><br><br> any ideas ?  Thanks<br><br> -Greg<p>Statistics: Posted by <a href="https://pybullet.org/Bullet/phpBB3/memberlist.php?mode=viewprofile&amp;u=7633">ranxx</a> — Mon Jan 10, 2011 10:33 pm</p><hr />
]]></content>
	</entry>
	</feed>
